{"text_format":"1","workbook":"xlsx","n_sheets":8,"sheets":["Payslip Calculator","Living Expense Calculator","Servicing Calculator","Benchmarks","Notes and Guidelines","Secondary Calculators","IT HEM Table","Rent Benchmark"],"not_rendered":{"charts":0,"images":5,"macros":1,"external_links":1,"defined_names":494,"comments":2,"pivot_tables":0},"unopened":[],"bounds":{"document_bytes":16777216,"sheet_cells":100000,"rows_first":2000,"rows_last":500,"rows_between":2000,"halvings":0,"cell_chars":16384,"cell_head_chars":4096},"cells_cut":0,"cells_raw":0,"read":"whole","date_system":"1900"}

{"sheet":"Payslip Calculator","index":0,"n_rows":88,"n_cols":25,"rows_kept":88,"cut":false,"hidden":false,"merged":[[22,2,22,3],[70,1,70,16],[55,19,55,24],[75,21,75,22],[17,4,17,5],[67,2,67,15],[71,1,71,16],[57,4,57,7],[57,11,57,14],[48,4,48,7],[49,4,49,7],[50,4,50,7],[51,4,51,7],[4,20,9,23],[61,3,65,8],[54,4,55,7],[54,11,55,14],[61,10,65,15],[54,8,55,8],[54,15,55,15],[51,11,51,14],[48,11,48,14],[22,9,22,10],[49,11,49,14],[50,11,50,14],[53,11,53,14],[54,2,55,3],[54,9,55,10],[53,4,53,7]]}
[null,null,null,null,null,null,null,null,{"$f":"IFERROR(MAX(E33:H33),TODAY())","v":"00:00:00"},{"$f":"MAX(E33:H33)","v":"00:00:00"},null,{"$f":"E18","v":"00:00:00"},{"$f":"COUNTBLANK(E18)","v":1},null,null,null,null,null,null,null,null,{"$f":"IF(TODAY()>=DATE(YEAR(TODAY()),7,1),DATE(YEAR(TODAY()),7,1),DATE(YEAR(TODAY())-1,7,1))","v":"2023-07-01"}]
[]
[]
[]
[null,null,null,null,null,null,null,null,null,null,null,null,{"$f":"TODAY()","v":"2024-02-28"},null,null,null,null,null,null,null,"To attach this income calculation to your application, please print a copy as pdf only. Do not save this excel document to Desksite."]
[null,null,null,null,null,null,null,null,null,null,null,null,{"$f":"M5-E33","v":45350}]
[]
[]
[]
[]
[null,null,null,null,null,null,null,null,null,null,null,null,null,null,null,null,null,null,null,null,{"$f":"IF(U13>0,\"*Error* the pay period appears incorrect. Please review\",\"\")","v":""}]
[]
[null,null,null,null,null,null,null,null,null,null,null,null,null,null,null,null,null,null,null,null,{"$f":"COUNTIF(E43:H43,\"error\")","v":0}]
[]
[]
[]
[]
[null,null,null,"Application Number:"]
[]
[null,null,null,null,null,null,null,null,null,null,null,null,null,null,null,null,null,null,null,null,"YTD Start Date:"]
{"$rows_left_out":69}
{"sheet":"Living Expense Calculator","index":1,"n_rows":41,"n_cols":14,"rows_kept":41,"cut":false,"hidden":true,"merged":[[39,2,39,11],[40,2,40,11]]}
[]
[]
[null,null,"This calculator is to be completed for all Macquarie Direct originated loans"]
[]
[null,null,"General Living Expenses (per month)","$",null,null,null,null,"Additional Living Expenses (per month)","$"]
[]
[null,null,"Medical and health (excluding health insurance)",0,null,"Monthly",{"$f":"IF(F7=\"Weekly\",52,IF(F7=\"Fortnightly\",26,IF(F7=\"Monthly\",12,IF(F7=\"Annually\",1,0))))","v":12},{"$f":"(D7*G7)/12","v":0},"Personal Insurance (health, life, personal accident)",0,null,"Monthly",{"$f":"IF(L7=\"Weekly\",52,IF(L7=\"Fortnightly\",26,IF(L7=\"Monthly\",12,IF(L7=\"Annually\",1,0))))","v":12},{"$f":"(J7*M7)/12","v":0}]
[]
[null,null,"Groceries",0,null,"Monthly",{"$f":"IF(F9=\"Weekly\",52,IF(F9=\"Fortnightly\",26,IF(F9=\"Monthly\",12,IF(F9=\"Annually\",1,0))))","v":12},{"$f":"(D9*G9)/12","v":0},"Private education",0,null,"Monthly",{"$f":"IF(L9=\"Weekly\",52,IF(L9=\"Fortnightly\",26,IF(L9=\"Monthly\",12,IF(L9=\"Annually\",1,0))))","v":12},{"$f":"(J9*M9)/12","v":0}]
[]
[null,null,"Clothing & Personal Care",0,null,"Monthly",{"$f":"IF(F11=\"Weekly\",52,IF(F11=\"Fortnightly\",26,IF(F11=\"Monthly\",12,IF(F11=\"Annually\",1,0))))","v":12},{"$f":"(D11*G11)/12","v":0},"Owner occupied strata/body corporate fees",0,null,"Monthly",{"$f":"IF(L11=\"Weekly\",52,IF(L11=\"Fortnightly\",26,IF(L11=\"Monthly\",12,IF(L11=\"Annually\",1,0))))","v":12},{"$f":"(J11*M11)/12","v":0}]
[]
[null,null,"Recreation & Entertainment (includes petcare)",0,null,"Monthly",{"$f":"IF(F13=\"Weekly\",52,IF(F13=\"Fortnightly\",26,IF(F13=\"Monthly\",12,IF(F13=\"Annually\",1,0))))","v":12},{"$f":"(D13*G13)/12","v":0},"Secondary residence/holiday home costs",0,null,"Monthly",{"$f":"IF(L13=\"Weekly\",52,IF(L13=\"Fortnightly\",26,IF(L13=\"Monthly\",12,IF(L13=\"Annually\",1,0))))","v":12},{"$f":"(J13*M13)/12","v":0}]
[]
[null,null,"Childcare",0,null,"Monthly",{"$f":"IF(F15=\"Weekly\",52,IF(F15=\"Fortnightly\",26,IF(F15=\"Monthly\",12,IF(F15=\"Annually\",1,0))))","v":12},{"$f":"(D15*G15)/12","v":0},"Other regular expenses",0,null,"Monthly",{"$f":"IF(L15=\"Weekly\",52,IF(L15=\"Fortnightly\",26,IF(L15=\"Monthly\",12,IF(L15=\"Annually\",1,0))))","v":12},{"$f":"(J15*M15)/12","v":0}]
[]
[null,null,"Telephone, Internet, Pay TV, Media streaming",0,null,"Monthly",{"$f":"IF(F17=\"Weekly\",52,IF(F17=\"Fortnightly\",26,IF(F17=\"Monthly\",12,IF(F17=\"Annually\",1,0))))","v":12},{"$f":"(D17*G17)/12","v":0}]
[]
[null,null,"Transport",0,null,"Monthly",{"$f":"IF(F19=\"Weekly\",52,IF(F19=\"Fortnightly\",26,IF(F19=\"Monthly\",12,IF(F19=\"Annually\",1,0))))","v":12},{"$f":"(D19*G19)/12","v":0}]
[]
{"$rows_left_out":22}
{"sheet":"Servicing Calculator","index":2,"n_rows":117,"n_cols":18,"rows_kept":117,"cut":false,"hidden":false,"merged":[[81,2,81,9],[3,2,3,5],[80,2,80,8],[47,8,49,8],[46,7,47,7],[78,7,78,8]]}
[]
[null,null,null,null,null,null,null,null,null,null,null,null,{"$f":"ROW(C26)","v":26},{"$f":"ROW(C108)","v":108},{"$f":"ROW(C117)","v":117},{"$f":"ROW(C25)","v":25},{"$f":"ROW(C86)","v":86},{"$f":"CONCATENATE(\"Benchmarks!B\",ROW(Benchmarks!B25),\":I\",ROW(Benchmarks!B27))","v":"Benchmarks!B25:I27"}]
[]
[null,null,{"$f":"IF(I4=\"Expired\",\"This toolkit has now expired\",\"Please ensure that all shaded fields have been completed\")","v":"Please ensure that all shaded fields have been completed"},null,null,null,null,{"$f":"CONCATENATE(\"Version: (\",TEXT('Secondary Calculators'!B39,\"dd mmm yyyy\"),\")\")","v":"Version: (01 Mar 2024)"},{"$f":"IF(TODAY()>'Secondary Calculators'!B40,\"Expired\",CONCATENATE(\"Expires in \",'Secondary Calculators'!B41,\" days\"))","v":"Expires in 62 days"}]
[null,null,"Applicant Details"]
[]
[null,null,"Application Type"]
[null,null,"Applicant Status"]
[null,null,"Number of Dependents",null,null,"Interest Rate",null,"Fixed"]
[null,null,"Residential Status"]
[null,null,"Quantity of Financed Assets"]
[]
[null,null,"Monthly Net Income",{"$f":"IF(D7=\"Sole Applicant with Non-Borrower Spouse\",\"Applicant\",\"Applicant 1\")","v":"Applicant 1"},null,{"$f":"IF(D7=\"Sole Applicant with Non-Borrower Spouse\",\"Spouse\",\"Applicant 2\")","v":"Applicant 2"},null,"Total Applied"]
[]
[null,null,"Net Income",0,null,0,null,{"$f":"Benchmarks!I14","v":0}]
[null,null,"Government Benefits Income",0,null,0,null,{"$f":"Benchmarks!I15","v":0}]
[null,null,"Superannuation Income",0,null,0,null,{"$f":"Benchmarks!I16","v":0}]
[null,null,"Investment Property Income",0,null,0,null,{"$f":"Benchmarks!I17","v":0}]
[null,null,"Investment Income",0,null,0,null,{"$f":"Benchmarks!I18","v":0}]
[null,null,"Other Income",0,null,0,null,{"$f":"Benchmarks!I19","v":0}]
{"$rows_left_out":98}
{"sheet":"Benchmarks","index":3,"n_rows":100,"n_cols":38,"rows_kept":100,"cut":false,"hidden":true,"merged":[[70,1,70,9],[2,1,2,6],[3,6,3,9],[9,6,9,7],[67,2,67,6],[69,1,69,9]]}
[null,null,null,null,null,null,null,null,null,null,null,null,{"$f":"ROW(B25)","v":25},{"$f":"ROW(B27)","v":27},null,null,null,null,null,null,null,null,null,null,null,null,null,null,null,null,{"$f":"ROW(C23)","v":23},{"$f":"ROW(B27)","v":27},{"$f":"ROW(B91)","v":91},{"$f":"ROW(B100)","v":100},null,{"$f":"'Servicing Calculator'!P2","v":25},{"$f":"'Servicing Calculator'!M2","v":26},{"$f":"CONCATENATE(\"'Servicing Calculator'!C\",AJ1,\":F\",AK1)","v":"'Servicing Calculator'!C25:F26"}]
[null,null,null,null,null,null,null,null,null,null,null,null,null,null,null,null,null,null,null,null,null,null,null,null,null,null,null,null,null,null,{"$f":"CONCATENATE(\"E\",AE1+2,\":E\",AF1-1,\"\")","v":"E25:E26"},{"$f":"CONCATENATE(\"I\",AE1+2,\":I\",AF1-1,\"\")","v":"I25:I26"}]
[null,"PLEASE ENSURE THAT ALL SHADED FIELDS HAVE BEEN COMPLETED",null,null,null,null,null,"Version: (17 Sep 2020)"]
[null,"Applicant Details",null,null,null,null,null,null,null,null,null,null,"Columns to be hidden"]
[]
[null,"Application Type",{"$f":"VLOOKUP(B6,'Servicing Calculator'!$C$7:$D$11,2,FALSE)","v":0},null,null,null,null,null,null,null,null,null,"Number of couples",{"$f":"COUNTIF(C6:H6, \"Couple\")","v":0}]
[null,"Applicant Status",{"$f":"VLOOKUP(B7,'Servicing Calculator'!$C$7:$D$11,2,FALSE)","v":0},null,null,null,null,null,null,null,null,null,"Number of couples",{"$f":"COUNTIF(C7:H7, \"Couple\")","v":0}]
[null,"Number of Dependents",{"$f":"VLOOKUP(B8,'Servicing Calculator'!$C$7:$D$11,2,FALSE)","v":0},null,null,null,"Capacity Buffer",null,{"$f":"IF(COUNTIF(C6:C10,0)=5,0,'Secondary Calculators'!C21)","v":0},null,null,null,"Number of children",{"$f":"C8+E8+G8+#REF!","v":{"$error":"#VALUE!"}}]
[null,"Residential Status",{"$f":"VLOOKUP(B9,'Servicing Calculator'!$C$7:$D$11,2,FALSE)","v":0},null,null,null,null,null,null,null,null,null,null,null,null,null,null,null,null,null,null,"Sole Applicant with Non-Borrower Spouse"]
[null,{"$f":"'Servicing Calculator'!C11","v":"Quantity of Financed Assets"},{"$f":"VLOOKUP(B10,'Servicing Calculator'!$C$7:$D$11,2,FALSE)","v":0}]
[]
[null,"Monthly Net Income","Applicant 1",null,{"$f":"'Servicing Calculator'!F13","v":"Applicant 2"},null,"Shading",null,"Total",null,null,null,null,"Test PC's",null,null,null,null,null,null,null,{"$f":"C12","v":"Applicant 1"},{"$f":"E12","v":"Applicant 2"},"Standard","Non-borrower"]
[]
[null,"Net Income",{"$f":"VLOOKUP(B14,'Servicing Calculator'!$C$15:$F$20,2,FALSE)","v":0},null,{"$f":"VLOOKUP(B14,'Servicing Calculator'!$C$15:$F$20,4,FALSE)","v":0},null,1,null,{"$f":"IF($C$6=$V$9,Y14,X14)","v":0},null,null,null,2545,"NSW cat4",null,null,null,null,null,null,null,{"$f":"C14*G14","v":0},{"$f":"E14*G14","v":0},{"$f":"(C14+E14)*G14","v":0},{"$f":"V14+MIN(V14:W14)","v":0}]
[null,"Government Benefits Income",{"$f":"VLOOKUP(B15,'Servicing Calculator'!$C$15:$F$20,2,FALSE)","v":0},null,{"$f":"IF(C6=\"Sole Applicant\",0,VLOOKUP(B15,'Servicing Calculator'!$C$15:$F$20,4,FALSE))","v":0},null,null,null,{"$f":"IF($C$6=$V$9,Y15,X15)","v":0},null,null,null,null,null,null,null,"Restricted Postcode",null,"High Density Postcode",null,null,{"$f":"MIN(C15,SUM(C14,C16:C18))","v":0},{"$f":"'Secondary Calculators'!C5","v":""},{"$f":"'Secondary Calculators'!E5","v":0},{"$f":"'Secondary Calculators'!F5","v":0}]
[null,"Superannuation Income",{"$f":"VLOOKUP(B16,'Servicing Calculator'!$C$15:$F$20,2,FALSE)","v":0},null,{"$f":"IF(C6=\"Sole Applicant\",0,VLOOKUP(B16,'Servicing Calculator'!$C$15:$F$20,4,FALSE))","v":0},null,1,null,{"$f":"IF($C$6=$V$9,Y16,X16)","v":0},null,null,null,null,null,null,null,"No",null,"No",null,null,{"$f":"C16*G16","v":0},{"$f":"E16*G16","v":0},{"$f":"(C16+E16)*G16","v":0},{"$f":"V16","v":0}]
[null,"Investment Property Income",{"$f":"VLOOKUP(B17,'Servicing Calculator'!$C$15:$F$20,2,FALSE)","v":0},null,{"$f":"IF(C6=\"Sole Applicant\",0,VLOOKUP(B17,'Servicing Calculator'!$C$15:$F$20,4,FALSE))","v":0},null,0.7,null,0,null,null,null,2204,"NSW cat1","750-900K MV",null,"No",null,"No",null,null,{"$f":"C17*G17","v":0},{"$f":"E17*G17","v":0},{"$f":"(C17+E17)*G17","v":0},{"$f":"V17","v":0}]
[null,"Investment Income",{"$f":"VLOOKUP(B18,'Servicing Calculator'!$C$15:$F$20,2,FALSE)","v":0},null,{"$f":"IF(C6=\"Sole Applicant\",0,VLOOKUP(B18,'Servicing Calculator'!$C$15:$F$20,4,FALSE))","v":0},null,0.8,null,0,null,null,null,2315,"NSW cat1","300-450K MV",null,"No",null,"No",null,null,{"$f":"C18*G18","v":0},0,{"$f":"(C18+E18)*G18","v":0},0]
[null,"Other Income",{"$f":"VLOOKUP(B19,'Servicing Calculator'!$C$15:$F$20,2,FALSE)","v":0},null,{"$f":"IF(C6=\"Sole Applicant\",0,VLOOKUP(B19,'Servicing Calculator'!$C$15:$F$20,4,FALSE))","v":0},null,0,null,0,null,null,null,2306,"NSW cat1","0-300K MV",null,"No",null,"No",null,null,0,0,{"$f":"(C19+E19)*G19","v":0},0]
[null,null,null,null,null,null,null,null,null,null,null,null,2306,"NSW cat1","0-300K MV",null,"No",null,"No",null,null,null,null,null,0]
{"$rows_left_out":81}
{"sheet":"Notes and Guidelines","index":4,"n_rows":54,"n_cols":6,"rows_kept":54,"cut":false,"hidden":false,"merged":[[35,2,35,10],[36,2,36,10],[37,2,37,10],[38,2,38,10],[33,2,33,10],[26,2,26,10],[28,2,28,10],[29,2,29,10],[30,2,30,10],[31,2,31,10],[16,2,16,10],[17,2,17,10],[18,2,18,10],[25,2,25,10],[19,2,19,10],[11,2,11,10],[12,2,12,10],[13,2,13,10],[14,2,14,10],[15,2,15,10],[2,2,2,9],[7,2,7,10],[8,2,8,10],[9,2,9,10],[10,2,10,10]]}
[]
[]
[null,null,"LOAN SERVICEABILITY WORKSHEET - NOTES and GUIDELINES"]
[]
[null,null,"User notes"]
[]
[]
[null,null,"* Please use the most current version, visit our website and download from our toolkit/resource hub"]
[null,null,"* Calculator includes an expiry date, after expiry calculator will be blank and out of date"]
[null,null,"* Please enter all relevant fields in grey, using whole amounts"]
[null,null,"* Total applied column will adjust automatically & will take into account our internal buffers"]
[null,null,"* Total assessed expenses will include our internal buffers based on applicant type and number of dependants"]
[null,null,"* Overtime and commission amounts may be considered provided it’s clear they’re ongoing and consistent in nature"]
[null,null,"* Other Income: List all other income that does not fit within the other income fields. Note that this income is not included for servicing"]
[null,null,"* Number of Dependants: For more than 8 dependants, select ‘8’"]
[null,null,"* Superannuation Income: Includes SMSF income and CSC income"]
[null,null,"* Any deductions already noted on the payslip or salary sacrifice statement are not required to be declared on the applicant’s expenses"]
[null,null,"*For investment property income, we’ll only consider 70% of this income to be included in the serviceability calculation, however 100% of the income should be declared"]
[null,null,"*For all investment income we’ll only consider 80% of this income to be included in the serviceability calculation, however 100% of the income should be declared"]
[null,null,"* If this proposed loan involves a replacement/refinance do not include the commitment"]
{"$rows_left_out":35}
{"sheet":"Secondary Calculators","index":5,"n_rows":86,"n_cols":6,"rows_kept":86,"cut":false,"hidden":true,"merged":[]}
["Government Benefits Income"]
[null,"Applicant 1","Applicant 2","Non B","Total","Total NB"]
["Declared Gov Income",{"$f":"Benchmarks!C15","v":0},{"$f":"Benchmarks!E15","v":0},0,{"$f":"B3+C3","v":0},{"$f":"B3","v":0}]
["Total non-Gov Income",{"$f":"SUM(Benchmarks!C14*Benchmarks!G14,Benchmarks!C16*Benchmarks!G16,Benchmarks!C17*Benchmarks!G17,Benchmarks!C18*Benchmarks!G18,Benchmarks!C19*Benchmarks!G19)","v":0},{"$f":"SUM(Benchmarks!E14*Benchmarks!G14,Benchmarks!E16*Benchmarks!G16,Benchmarks!E17*Benchmarks!G17,Benchmarks!E18*Benchmarks!G18,Benchmarks!E19*Benchmarks!G19)","v":0},{"$f":"Benchmarks!E14","v":0},{"$f":"B4+C4","v":0},{"$f":"B4+D4","v":0}]
["Applied Gov Income",{"$f":"IFERROR(IF(B3>0,MIN(B3:B4),\"\"),\"\")","v":""},{"$f":"IFERROR(IF(C3>0,MIN(C3:C4),\"\"),\"\")","v":""},{"$f":"IFERROR(IF(D3>0,MIN(D3:D4),\"\"),\"\")","v":""},{"$f":"IF(E3>E4,E4,E3)","v":0},{"$f":"IF(F3>F4,F4,F3)","v":0}]
[]
["IT HEM Amount"]
["Applicant Type",{"$f":"Benchmarks!C7","v":0}]
["Number of Dependants",{"$f":"Benchmarks!C8","v":0}]
["Column ID",{"$f":"IF(AND(B8=0,B9=0),\"INCOMPLETE\",CONCATENATE(IF(LEFT(B8,1)=\"M\",\"D\",\"S\"),B9))","v":"INCOMPLETE"}]
["Total Income",{"$f":"'Servicing Calculator'!D22+'Servicing Calculator'!F22-'Servicing Calculator'!D18-'Servicing Calculator'!F18-'Servicing Calculator'!D20-'Servicing Calculator'!F20","v":0}]
["IT HEM",{"$f":"INDEX('IT HEM Table'!A3:Q24,MATCH(TRUE,'IT HEM Table'!Q3:Q24,0),MATCH(TRUE,'IT HEM Table'!A24:Q24,0))","v":{"$error":"#N/A"}}]
[]
[]
["Capacity Buffer"]
[]
["Single",null,100,"<-Obsolete after car loan servicing changes 21/04/22"]
["Married no dependants",null,120,"<-Obsolete after car loan servicing changes 21/04/23"]
["Married with dependants",null,180,"<-Obsolete after car loan servicing changes 21/04/24"]
["Applied buffer",null,{"$f":"IF(LEFT(B10,1)=\"S\",C17,IF(B10=\"D0\",C18,C19))","v":180},"<-Obsolete after car loan servicing changes 21/04/25"]
{"$rows_left_out":67}
{"sheet":"IT HEM Table","index":6,"n_rows":26,"n_cols":22,"rows_kept":26,"cut":false,"hidden":true,"merged":[]}
["2022Q2 HEM values (effective 1/07/2023 -- tentative)"]
[]
[null,1975.6666666666667,1975.6666666666667,2785.6666666666665,3606.9166666666665,4281.916666666667,4956.916666666667,6363.166666666667,7754.416666666667,9066.9166666666661,10326.916666666666,11519.416666666666,13811.083333333334,16606.916666666668,19448.583333333332,"More than"]
[null,"or less","to","to","to","to","to","to","to","to","to","to","to","to","to",0]
["Australia",0,2785.6666666666665,3606.9166666666665,4281.916666666667,4956.916666666667,6363.166666666667,7754.416666666667,9066.9166666666661,10326.916666666666,11519.416666666666,13811.083333333334,16606.916666666668,19448.583333333332,30815.25,30815.25,null,null,null,null,null,"INDEX"]
["Couple",2438,2438,2498,2583,2750,2991,3335,3655,4036,4226,4435,4980,5504,5683,5683,{"$f":"IF(V6='Secondary Calculators'!$B$10,TRUE,FALSE)","v":false},null,null,null,null,"D0"]
["Couple with 1 child",2875,2875,2875,2960,3127,3368,3712,4031,4412,4601,4811,5355,5878,6058,6058,{"$f":"IF(V7='Secondary Calculators'!$B$10,TRUE,FALSE)","v":false},null,null,null,null,"D1"]
["Couple with 2 children",3189,3189,3189,3274,3441,3682,4027,4347,4728,4917,5127,5672,6195,6375,6375,{"$f":"IF(V8='Secondary Calculators'!$B$10,TRUE,FALSE)","v":false},null,null,null,null,"D2"]
["Couple with 3 children",3545,3545,3545,3545,3713,3954,4299,4619,5001,5191,5401,5947,6471,6651,6651,{"$f":"IF(V9='Secondary Calculators'!$B$10,TRUE,FALSE)","v":false},null,null,null,null,"D3"]
["Couple with 4 children",3914,3914,3894,3866,4034,4275,4621,4941,5323,5513,5723,6270,6794,6974,6974,{"$f":"IF(V10='Secondary Calculators'!$B$10,TRUE,FALSE)","v":false},null,null,null,null,"D4"]
["Couple with 5 children",4283,4283,4243,4187,4355,4596,4943,5263,5645,5835,6045,6593,7117,7297,7297,{"$f":"IF(V11='Secondary Calculators'!$B$10,TRUE,FALSE)","v":false},null,null,null,null,"D5"]
["Couple with 6 children",4652,4652,4592,4508,4676,4917,5265,5585,5967,6157,6367,6916,7440,7620,7620,{"$f":"IF(V12='Secondary Calculators'!$B$10,TRUE,FALSE)","v":false},null,null,null,null,"D6"]
["Couple with 7 children",5021,5021,4941,4829,4997,5238,5587,5907,6289,6479,6689,7239,7763,7943,7943,{"$f":"IF(V13='Secondary Calculators'!$B$10,TRUE,FALSE)","v":false},null,null,null,null,"D7"]
["Couple with 8 or more children",5390,5390,5290,5150,5318,5559,5909,6229,6611,6801,7011,7562,8086,8266,8266,{"$f":"IF(V14='Secondary Calculators'!$B$10,TRUE,FALSE)","v":false},null,null,null,null,"D8"]
["Single person",1869,1869,1869,1869,1869,1869,2214,2535,2916,3106,3316,3862,4386,4566,4566,{"$f":"IF(V15='Secondary Calculators'!$B$10,TRUE,FALSE)","v":false},null,null,null,null,"S0"]
["Single parent with 1 child",1755,1755,1814,1900,2067,2307,2652,2972,3352,3542,3751,4296,4820,4999,4999,{"$f":"IF(V16='Secondary Calculators'!$B$10,TRUE,FALSE)","v":false},null,null,null,null,"S1"]
["Single parent with 2 children",2247,2247,2307,2392,2558,2798,3142,3461,3840,4030,4238,4782,5304,5483,5483,{"$f":"IF(V17='Secondary Calculators'!$B$10,TRUE,FALSE)","v":false},null,null,null,null,"S2"]
["Single parent with 3 children",2799,2799,2799,2884,3050,3289,3631,3950,4328,4517,4725,5267,5788,5966,5966,{"$f":"IF(V18='Secondary Calculators'!$B$10,TRUE,FALSE)","v":false},null,null,null,null,"S3"]
["Single parent with 4 children",3109,3109,3109,3223,3444,3763,4104,4422,4799,4988,5195,5736,6256,6433,6433,{"$f":"IF(V19='Secondary Calculators'!$B$10,TRUE,FALSE)","v":false},null,null,null,null,"S4"]
["Single parent with 5 children",3419,3419,3419,3562,3838,4237,4577,4894,5270,5459,5665,6205,6724,6900,6900,{"$f":"IF(V20='Secondary Calculators'!$B$10,TRUE,FALSE)","v":false},null,null,null,null,"S5"]
{"$rows_left_out":7}
{"sheet":"Rent Benchmark","index":7,"n_rows":2527,"n_cols":13,"rows_kept":2527,"cut":false,"hidden":true,"merged":[]}
["RENTAL MEDIAN AMOUNTS"]
["Postcode","HOUSE","UNIT",null,"Postcode","HOUSE","UNIT",null,null,null,"Residential State","Floor"]
[800,2903,2340,null,{"$f":"Benchmarks!C10","v":0},{"$f":"VLOOKUP(E3,A3:C2527,2,FALSE)","v":{"$error":"#N/A"}},{"$f":"VLOOKUP(E3,A3:C2527,3,FALSE)","v":{"$error":"#N/A"}},null,null,null,"NSW",780]
[810,2903,2340,null,null,null,null,null,null,null,"ACT",704]
[812,2903,2340,null,"Declared Rent",null,{"$f":"Benchmarks!E52","v":0},null,null,null,"NT",715]
[820,2903,2340,null,"80% of Rent Benchmark",null,{"$f":"G3*0.8","v":{"$error":"#N/A"}},null,null,null,"QLD",628]
[822,2080,1647,null,"Applied Rent",null,{"$f":"IF(G5<G6,G6,G5)","v":{"$error":"#N/A"}},null,null,null,"SA",520]
[828,2903,2340,null,null,null,null,null,null,null,"TAS",455]
[830,2600,1993,null,null,null,null,null,null,null,"VIC",639]
[832,2600,1993,null,null,null,null,null,null,null,"WA",585]
[835,2817,2058,null,null,null,null,null,null,null,null,780]
[836,2817,2058]
[837,2817,2058,null,null,null,null,null,null,null,"Relationship Status",{"$f":"'Servicing Calculator'!D8","v":0}]
[838,2817,2058,null,null,null,null,null,null,null,"State",{"$f":"'Servicing Calculator'!D11","v":0}]
[840,2080,1647,null,null,null,null,null,null,null,"Multiplier",{"$f":"IF(L13=\"Single\",1,1.5)","v":1.5}]
[841,2817,2058,null,null,null,null,null,null,null,"Vlookup",650,{"$f":"IFERROR(VLOOKUP(L14,K3:L11,2,FALSE),L11)","v":780}]
[845,2080,1647,null,null,null,null,null,null,null,{"$f":"\"+ multiplier\"","v":"+ multiplier"},{"$f":"L16*L15","v":975}]
[847,2080,1647,null,null,null,null,null,null,null,"Declared Rent",{"$f":"'Servicing Calculator'!F68","v":0}]
[850,2080,1647,null,null,null,null,null,null,null,"Applied Rent",{"$f":"IF(L18>L17,L18,L17)","v":975}]
[852,2080,1647]
{"$rows_left_out":2507}